Kismet Wireless

Kismet Forums

 

Posted by:iMiKE
Subject:Compile problems on macOS 10.12 Sierra
Date:04:22:17 22/09/2016

Hello!
Downloaded kismet-2016-07-R1, extracted, configured.
Configuration complete:
Compiling for: darwin16.0.0 (x86_64)
C++ Library: stdc++
Installing as group: wheel
Man pages owned by: wheel
Installing into: /usr/local
Setuid group: staff
Terminal Control: ncurses
Linux WEXT capture : n/a (only Linux)
OSX/Darwin capture : yes
PCRE Regex Filters : yes
pcap capture: yes
airpcap control: n/a (only Cygwin/Win32)
PPI log format: yes
LibCapability (enhanced
privilege dropping): n/a (only Linux)
Linux Netlink: n/a (only Linux)

So, I launching gmake.
Erreors during compile appears
g++ -D_THREAD_SAFE -pthread -I/usr/include/ncurses -Wall -g -O2 -c darwin_control_wrapper.m -o darwin_control_wrapper.mo
In file included from darwin_control_wrapper.m:30:
In file included from /System/Library/Frameworks/Foundation.framework/Headers/Foundation.h:10:
In file included from /System/Library/Frameworks/Foundation.framework/Headers/NSArray.h:5:
/System/Library/Frameworks/Foundation.framework/Headers/NSObject.h:44:12: error: unknown property attribute 'class'
@property (class, readonly) BOOL supportsSecureCoding;
^
In file included from darwin_control_wrapper.m:30:
In file included from /System/Library/Frameworks/Foundation.framework/Headers/Foundation.h:12:
In file included from /System/Library/Frameworks/Foundation.framework/Headers/NSBundle.h:6:
/System/Library/Frameworks/Foundation.framework/Headers/NSString.h:262:12: error: unknown property attribute 'class'
@property (class, readonly) const NSStringEncoding *availableStringEncodings;
^
/System/Library/Frameworks/Foundation.framework/Headers/NSString.h:269:12: error: unknown property attribute 'class'
@property (class, readonly) NSStringEncoding defaultCStringEncoding; // Should be rarely used
^
In file included from darwin_control_wrapper.m:30:
In file included from /System/Library/Frameworks/Foundation.framework/Headers/Foundation.h:12:
In file included from /System/Library/Frameworks/Foundation.framework/Headers/NSBundle.h:11:
/System/Library/Frameworks/Foundation.framework/Headers/NSNotification.h:45:12: error: unknown property attribute 'class'
@property (class, readonly, strong) NSNotificationCenter *defaultCenter;
^
In file included from darwin_control_wrapper.m:30:
In file included from /System/Library/Frameworks/Foundation.framework/Headers/Foundation.h:12:
/System/Library/Frameworks/Foundation.framework/Headers/NSBundle.h:33:12: error: unknown property attribute 'class'
@property (class, readonly, strong) NSBundle *mainBundle;
^
/System/Library/Frameworks/Foundation.framework/Headers/NSBundle.h:46:12: error: unknown property attribute 'class'
@property (class, readonly, copy) NSArray<NSBundle *> *allBundles;
^
/System/Library/Frameworks/Foundation.framework/Headers/NSBundle.h:47:12: error: unknown property attribute 'class'
@property (class, readonly, copy) NSArray<NSBundle *> *allFrameworks;
^
In file included from darwin_control_wrapper.m:30:
In file included from /System/Library/Frameworks/Foundation.framework/Headers/Foundation.h:14:
In file included from /System/Library/Frameworks/Foundation.framework/Headers/NSCalendar.h:7:
/System/Library/Frameworks/Foundation.framework/Headers/NSDate.h:46:12: error: unknown property attribute 'class'
@property (class, readonly) NSTimeInterval timeIntervalSinceReferenceDate;
^
/System/Library/Frameworks/Foundation.framework/Headers/NSDate.h:60:12: error: unknown property attribute 'class'
@property (class, readonly, copy) NSDate *distantFuture;
^
/System/Library/Frameworks/Foundation.framework/Headers/NSDate.h:61:12: error: unknown property attribute 'class'
@property (class, readonly, copy) NSDate *distantPast;
^
In file included from darwin_control_wrapper.m:30:
In file included from /System/Library/Frameworks/Foundation.framework/Headers/Foundation.h:14:
/System/Library/Frameworks/Foundation.framework/Headers/NSCalendar.h:108:12: error: unknown property attribute 'class'
@property (class, readonly, copy) NSCalendar *currentCalendar; // user's preferred calendar
^
/System/Library/Frameworks/Foundation.framework/Headers/NSCalendar.h:109:12: error: unknown property attribute 'class'
@property (class, readonly, strong) NSCalendar *autoupdatingCurrentCalendar NS_AVAILABLE(10_5, 2_0); // tracks changes to user's preferred calendar identifier
^
In file included from darwin_control_wrapper.m:30:
In file included from /System/Library/Frameworks/Foundation.framework/Headers/Foundation.h:15:
/System/Library/Frameworks/Foundation.framework/Headers/NSCharacterSet.h:21:22: error: unknown property attribute 'class'
@property (readonly, class, copy) NSCharacterSet *controlCharacterSet;
^
/System/Library/Frameworks/Foundation.framework/Headers/NSCharacterSet.h:22:22: error: unknown property attribute 'class'
@property (readonly, class, copy) NSCharacterSet *whitespaceCharacterSet;
^
/System/Library/Frameworks/Foundation.framework/Headers/NSCharacterSet.h:23:22: error: unknown property attribute 'class'
@property (readonly, class, copy) NSCharacterSet *whitespaceAndNewlineCharacterSet;
^
/System/Library/Frameworks/Foundation.framework/Headers/NSCharacterSet.h:24:22: error: unknown property attribute 'class'
@property (readonly, class, copy) NSCharacterSet *decimalDigitCharacterSet;
^
/System/Library/Frameworks/Foundation.framework/Headers/NSCharacterSet.h:25:22: error: unknown property attribute 'class'
@property (readonly, class, copy) NSCharacterSet *letterCharacterSet;
^
/System/Library/Frameworks/Foundation.framework/Headers/NSCharacterSet.h:26:22: error: unknown property attribute 'class'
@property (readonly, class, copy) NSCharacterSet *lowercaseLetterCharacterSet;
^
/System/Library/Frameworks/Foundation.framework/Headers/NSCharacterSet.h:27:22: error: unknown property attribute 'class'
@property (readonly, class, copy) NSCharacterSet *uppercaseLetterCharacterSet;
^
fatal error: too many errors emitted, stopping now [-ferror-limit=]
20 errors generated.
Makefile:320: error executing recipe for target ┬źdarwin_control_wrapper.mo┬╗
gmake: *** [darwin_control_wrapper.mo] Error 1

Can you help me to compile?


Reply to this message